{"text_format":"1","workbook":"xlsx","n_sheets":3,"sheets":["Contribution Report","Rate Lookup","Sheet2"],"not_rendered":{"charts":0,"images":0,"macros":1,"external_links":0,"defined_names":7,"comments":0,"pivot_tables":0},"unopened":[],"bounds":{"document_bytes":16777216,"sheet_cells":100000,"rows_first":2000,"rows_last":500,"rows_between":2000,"halvings":0,"cell_chars":16384,"cell_head_chars":4096},"cells_cut":0,"cells_raw":0,"read":"whole","date_system":"1900"}

{"sheet":"Contribution Report","index":0,"n_rows":36,"n_cols":11,"rows_kept":36,"cut":false,"hidden":false,"merged":[[216,0,216,3],[217,0,217,3],[218,0,218,3],[34,5,34,6],[98,0,98,3],[99,0,99,3],[100,0,100,3],[101,0,101,3],[102,0,102,3],[103,0,103,3],[104,0,104,3],[105,0,105,3],[106,0,106,3],[89,0,89,3],[90,0,90,3],[91,0,91,3],[92,0,92,3],[93,0,93,3],[94,0,94,3],[95,0,95,3],[96,0,96,3],[97,0,97,3],[60,0,60,3],[61,0,61,3],[63,0,63,3],[64,0,64,3],[65,0,65,3],[66,0,66,3],[67,0,67,3],[68,0,68,3],[51,0,51,3],[52,0,52,3],[53,0,53,3],[54,0,54,3],[55,0,55,3],[56,0,56,3],[57,0,57,3],[58,0,58,3],[59,0,59,3],[212,4,212,5],[213,4,213,5],[214,4,214,5],[215,4,215,5],[216,4,216,5],[217,4,217,5],[218,4,218,5],[35,0,35,3],[36,0,36,3],[37,0,37,3],[38,0,38,3],[39,0,39,3],[40,0,40,3],[41,0,41,3],[42,0,42,3],[43,0,43,3],[44,0,44,3],[45,0,45,3],[46,0,46,3],[47,0,47,3],[48,0,48,3],[49,0,49,3],[50,0,50,3],[62,0,62,3],[203,4,203,5],[204,4,204,5],[205,4,205,5],[206,4,206,5],[207,4,207,5],[208,4,208,5],[209,4,209,5],[210,4,210,5],[211,4,211,5],[194,4,194,5],[195,4,195,5],[196,4,196,5],[197,4,197,5],[198,4,198,5],[199,4,199,5],[200,4,200,5],[201,4,201,5],[202,4,202,5],[185,4,185,5],[186,4,186,5],[187,4,187,5],[188,4,188,5],[189,4,189,5],[190,4,190,5],[191,4,191,5],[192,4,192,5],[193,4,193,5],[176,4,176,5],[177,4,177,5],[178,4,178,5],[179,4,179,5],[180,4,180,5],[181,4,181,5],[182,4,182,5],[183,4,183,5],[184,4,184,5],[167,4,167,5],[168,4,168,5],[169,4,169,5],[170,4,170,5],[171,4,171,5],[172,4,172,5],[173,4,173,5],[174,4,174,5],[175,4,175,5],[158,4,158,5],[159,4,159,5],[160,4,160,5],[161,4,161,5],[162,4,162,5],[163,4,163,5],[164,4,164,5],[165,4,165,5],[166,4,166,5],[149,4,149,5],[150,4,150,5],[151,4,151,5],[152,4,152,5],[153,4,153,5],[154,4,154,5],[155,4,155,5],[156,4,156,5],[157,4,157,5],[140,4,140,5],[141,4,141,5],[142,4,142,5],[143,4,143,5],[144,4,144,5],[145,4,145,5],[146,4,146,5],[147,4,147,5],[148,4,148,5],[131,4,131,5],[132,4,132,5],[133,4,133,5],[134,4,134,5],[135,4,135,5],[136,4,136,5],[137,4,137,5],[138,4,138,5],[139,4,139,5],[122,4,122,5],[123,4,123,5],[124,4,124,5],[125,4,125,5],[126,4,126,5],[127,4,127,5],[128,4,128,5],[129,4,129,5],[130,4,130,5],[113,4,113,5],[114,4,114,5],[115,4,115,5],[116,4,116,5],[117,4,117,5],[118,4,118,5],[119,4,119,5],[120,4,120,5],[121,4,121,5],[104,4,104,5],[105,4,105,5],[106,4,106,5],[107,4,107,5],[108,4,108,5],[109,4,109,5],[110,4,110,5],[111,4,111,5],[112,4,112,5],[95,4,95,5],[96,4,96,5],[97,4,97,5],[98,4,98,5],[99,4,99,5],[100,4,100,5],[101,4,101,5],[102,4,102,5],[103,4,103,5],[86,4,86,5],[87,4,87,5],[88,4,88,5],[89,4,89,5],[90,4,90,5],[91,4,91,5],[92,4,92,5],[93,4,93,5],[94,4,94,5],[77,4,77,5],[78,4,78,5],[79,4,79,5],[80,4,80,5],[81,4,81,5],[82,4,82,5],[83,4,83,5],[84,4,84,5],[85,4,85,5],[68,4,68,5],[69,4,69,5],[70,4,70,5],[71,4,71,5],[72,4,72,5],[73,4,73,5],[74,4,74,5],[75,4,75,5],[76,4,76,5],[194,0,194,3],[175,0,175,3],[176,0,176,3],[177,0,177,3],[178,0,178,3],[179,0,179,3],[44,4,44,5],[45,4,45,5],[46,4,46,5],[47,4,47,5],[48,4,48,5],[49,4,49,5],[50,4,50,5],[51,4,51,5],[52,4,52,5],[58,4,58,5],[59,4,59,5],[60,4,60,5],[61,4,61,5],[62,4,62,5],[63,4,63,5],[64,4,64,5],[65,4,65,5],[66,4,66,5],[185,0,185,3],[186,0,186,3],[187,0,187,3],[188,0,188,3],[189,0,189,3],[190,0,190,3],[191,0,191,3],[192,0,192,3],[193,0,193,3],[209,0,209,3],[210,0,210,3],[211,0,211,3],[212,0,212,3],[213,0,213,3],[214,0,214,3],[215,0,215,3],[195,0,195,3],[196,0,196,3],[197,0,197,3],[198,0,198,3],[199,0,199,3],[200,0,200,3],[201,0,201,3],[202,0,202,3],[203,0,203,3],[204,0,204,3],[205,0,205,3],[206,0,206,3],[207,0,207,3],[208,0,208,3],[180,0,180,3],[181,0,181,3],[182,0,182,3],[183,0,183,3],[184,0,184,3],[165,0,165,3],[166,0,166,3],[167,0,167,3],[168,0,168,3],[169,0,169,3],[170,0,170,3],[171,0,171,3],[172,0,172,3],[173,0,173,3],[174,0,174,3],[164,0,164,3],[145,0,145,3],[146,0,146,3],[147,0,147,3],[148,0,148,3],[149,0,149,3],[150,0,150,3],[151,0,151,3],[152,0,152,3],[153,0,153,3],[154,0,154,3],[155,0,155,3],[156,0,156,3],[157,0,157,3],[158,0,158,3],[159,0,159,3],[160,0,160,3],[161,0,161,3],[162,0,162,3],[163,0,163,3],[144,0,144,3],[125,0,125,3],[126,0,126,3],[127,0,127,3],[128,0,128,3],[129,0,129,3],[130,0,130,3],[131,0,131,3],[132,0,132,3],[133,0,133,3],[134,0,134,3],[135,0,135,3],[136,0,136,3],[137,0,137,3],[138,0,138,3],[139,0,139,3],[140,0,140,3],[141,0,141,3],[142,0,142,3],[143,0,143,3],[124,0,124,3],[107,0,107,3],[108,0,108,3],[109,0,109,3],[110,0,110,3],[111,0,111,3],[112,0,112,3],[113,0,113,3],[114,0,114,3],[115,0,115,3],[116,0,116,3],[117,0,117,3],[118,0,118,3],[119,0,119,3],[120,0,120,3],[121,0,121,3],[122,0,122,3],[123,0,123,3],[85,0,85,3],[86,0,86,3],[87,0,87,3],[88,0,88,3],[75,0,75,3],[76,0,76,3],[77,0,77,3],[78,0,78,3],[79,0,79,3],[80,0,80,3],[81,0,81,3],[82,0,82,3],[83,0,83,3],[84,0,84,3],[69,0,69,3],[70,0,70,3],[71,0,71,3],[72,0,72,3],[73,0,73,3],[74,0,74,3],[31,2,31,4],[32,2,32,4],[33,2,33,4],[53,4,53,5],[54,4,54,5],[55,4,55,5],[56,4,56,5],[57,4,57,5],[35,4,35,5],[36,4,36,5],[37,4,37,5],[38,4,38,5],[39,4,39,5],[40,4,40,5],[41,4,41,5],[42,4,42,5],[43,4,43,5],[67,4,67,5],[10,2,10,4],[34,0,34,4],[4,0,4,9],[0,0,0,9],[1,0,1,9],[2,0,2,9],[14,2,14,4],[6,3,6,4],[7,3,7,4],[18,2,18,4],[20,2,20,4],[12,2,12,4],[6,5,6,9],[21,2,21,4],[16,2,16,4],[24,0,29,4],[13,5,14,9]]}
["EMPLOYERS COMBINED REPORT OF CONTRIBUTIONS FOR"]
["LISTED FUNDS OF LABORERS LOCAL 100 & 397"]
["Fund Office (314) 367-6555"]
[]
["CONTRIBUTIONS REMITTED AFTER THE 15TH OF THE MONTH ARE DELINQUENT.  PAYMENTS RECEIVED AFTER THE 20TH OF THE MONTH WILL BE SUBJECT TO A LIQUIDATED DAMAGES ASSESSMENT OF 10 PERCENT (10%) OF TOTAL CONTRIBUTIONS."]
[]
["Reporting Period:",null,null,"August, 2020",null,{"$f":"VLOOKUP(D7,'Rate Lookup'!S2:T400,2,FALSE)","v":"Rates Effective 8/1/2020"}]
[null,null,null,"Month, Year",null,null,null,"ST","TH","DT"]
[null,null,null,null,null,"Welfare",null,{"$f":"VLOOKUP($F$7,'Rate Lookup'!$A$3:$Q$11,3,FALSE)","v":8.4499999999999993},{"$f":"VLOOKUP($F$7,'Rate Lookup'!$A$3:$Q$11,4,FALSE)","v":12.674999999999999},{"$f":"VLOOKUP($F$7,'Rate Lookup'!$A$3:$Q$11,5,FALSE)","v":16.899999999999999}]
[null,null,null,null,null,"Pension",null,{"$f":"VLOOKUP($F$7,'Rate Lookup'!$A$3:$Q$11,7,FALSE)","v":10.9},{"$f":"VLOOKUP($F$7,'Rate Lookup'!$A$3:$Q$11,8,FALSE)","v":16.350000000000001},{"$f":"VLOOKUP($F$7,'Rate Lookup'!$A$3:$Q$11,9,FALSE)","v":21.8}]
["Employer:",null,null,null,null,"Annuity",null,{"$f":"VLOOKUP($F$7,'Rate Lookup'!$A$3:$Q$11,11,FALSE)","v":5},{"$f":"VLOOKUP($F$7,'Rate Lookup'!$A$3:$Q$11,12,FALSE)","v":7.5},{"$f":"VLOOKUP($F$7,'Rate Lookup'!$A$3:$Q$11,13,FALSE)","v":10}]
[null,null,null,null,null,"Training",null,{"$f":"VLOOKUP($F$7,'Rate Lookup'!$A$3:$Q$11,15,FALSE)","v":0.8},{"$f":"VLOOKUP($F$7,'Rate Lookup'!$A$3:$Q$11,16,FALSE)","v":0.8},{"$f":"VLOOKUP($F$7,'Rate Lookup'!$A$3:$Q$106,17,FALSE)","v":0.8}]
["Contact Name:",null,null,null,null,"Total",null,{"$f":"SUM(H9:H12)","v":25.150000000000002},{"$f":"SUM(I9:I12)","v":37.324999999999996},{"$f":"SUM(J9:J12)","v":49.5}]
[null,null,null,null,null,"Monthly Contribution Report Summary"]
["Address:"]
[null,null,null,null,null,null,"ST","TH","DT"]
[null,null,null,null,null,"Hours",{"$f":"H35","v":0},{"$f":"I35","v":0},{"$f":"J35","v":0}]
[null,null,null,null,null," x Rate",{"$f":"H13","v":25.150000000000002},{"$f":"I13","v":37.324999999999996},{"$f":"J13","v":49.5}]
["Phone Number:",null,null,null,null,"Total",{"$f":"ROUND(G17*G18,2)","v":0},{"$f":"ROUND(H17*H18,2)","v":0},{"$f":"ROUND(I17*I18,2)","v":0}]
[null,null,null,null,null,null,null,null,"Subtotal:",{"$f":"SUM(G19:I19)","v":0}]
["Email:",null,null,null,null,null,null,null,"Liquidated Damages:"]
[null,null,null,null,null,null,null,null,"Adjustment:"]
[null,null,null,null,null,null,null,null,"Total Contribution Due:",{"$f":"+J22+J21+J20","v":0}]
[null,null,null,null,null,"Submit form electronically through:"]
["The undersigned employer, if not already a signator, hereby becomes a signatory party to the currently applicable collective bargaining agreement with Laborers Locals 100 & 397 covering the type and area of work of the below employees and also to each agreement and Declaration of Trust, and amendments, establishing the funds for which payment is made herewith.",null,null,null,null,null,"https://www.ekonbenefits.com/securesend"]
[null,null,null,null,null,"Make check payable to:"]
[null,null,null,null,null,null,"Employers & Laborers Locals 100 & 397 Funds"]
[]
[null,null,null,null,null,"Return one hard copy with your remittance to:"]
[null,null,null,null,null,null,"Commerce Bank"]
[null,null,null,null,null,null,"P.O. Box 802810"]
[null,"Print Name:",null,null,null,null,"Kansas City, MO 64180-2810"]
[]
[null,"Date:",null,null,null,"Call Ekon Benefits at (314) 367-6555 with questions"]
[{"$f":"C11","v":0},null,null,null,null,"Total Hours",null,{"$f":"SUM(H37:H214)","v":0},{"$f":"SUM(I37:I219)","v":0},{"$f":"SUM(J37:J219)","v":0},{"$f":"COUNTA(A37:C219)","v":0}]
["Name",null,null,null,"SSN",null,"Local #  100/397","Straight Time Hours","Time & One-Half Hours","Double Time Hours"]

{"sheet":"Rate Lookup","index":1,"n_rows":80,"n_cols":20,"rows_kept":80,"cut":false,"hidden":false,"merged":[]}
[]
[null,null,"Straight Time","Time &   One-Half","Double Time",null,"Straight Time","Time &   One-Half","Double Time",null,"Straight Time","Time &   One-Half","Double Time",null,"Straight Time","Time &   One-Half","Double Time",null,"January, 2015","Rates Effective 8/1/2014"]
["Rates Effective 8/1/2014","Welfare",7.1,{"$f":"ROUND(C3*1.5,2)","v":10.65},{"$f":"C3*2","v":14.2},"Pension",8.85,{"$f":"(G3*1.5)","v":13.274999999999999},{"$f":"G3*2","v":17.7},"Annuity",2.5499999999999998,{"$f":"ROUND(K3*1.5,2)","v":3.83},{"$f":"K3*2","v":5.0999999999999996},"Training",0.8,0.8,0.8,null,"February, 2015","Rates Effective 8/1/2014"]
["Rates Effective 8/1/2015","Welfare",7.4,{"$f":"ROUND(C4*1.5,2)","v":11.1},14.8,"Pension",9,13.5,18,"Annuity",2.8,{"$f":"ROUND(K4*1.5,2)","v":4.2},5.6,"Training",0.8,0.8,0.8,null,"March, 2015","Rates Effective 8/1/2014"]
["Rates Effective 8/1/2016","Welfare",8,{"$f":"ROUND(C5*1.5,2)","v":12},16,"Pension",9.25,13.875,18.5,"Annuity",3,{"$f":"ROUND(K5*1.5,2)","v":4.5},6,"Training",0.8,0.8,0.8,null,"April, 2015","Rates Effective 8/1/2014"]
["Rates Effective 8/1/2017","Welfare",8.25,{"$f":"(C6*1.5)","v":12.375},16.5,"Pension",9.75,14.625,19.5,"Annuity",3.65,{"$f":"(K6*1.5)","v":5.4749999999999996},7.3,"Training",0.8,0.8,0.8,null,"May, 2015","Rates Effective 8/1/2014"]
["Rates Effective 8/1/2018","Welfare",8.25,{"$f":"(C7*1.5)","v":12.375},16.5,"Pension",9.9,14.850000000000001,19.8,"Annuity",4.1500000000000004,{"$f":"(K7*1.5)","v":6.2250000000000005},8.3000000000000007,"Training",0.8,0.8,0.8,null,"June, 2015","Rates Effective 8/1/2014"]
["Rates Effective 8/1/2019","Welfare",8.3000000000000007,{"$f":"(C8*1.5)","v":12.450000000000001},16.600000000000001,"Pension",10.4,15.600000000000001,20.8,"Annuity",4.5,{"$f":"(K8*1.5)","v":6.75},9,"Training",0.8,0.8,0.8,null,"July, 2015","Rates Effective 8/1/2014"]
["Rates Effective 8/1/2020","Welfare",8.4499999999999993,{"$f":"(C9*1.5)","v":12.674999999999999},{"$f":"C9*2","v":16.899999999999999},"Pension",10.9,{"$f":"(G9*1.5)","v":16.350000000000001},{"$f":"G9*2","v":21.8},"Annuity",5,{"$f":"(K9*1.5)","v":7.5},{"$f":"K9*2","v":10},"Training",0.8,0.8,0.8,null,"August, 2015","Rates Effective 8/1/2015"]
[null,null,null,null,null,null,null,null,null,null,null,null,null,null,null,null,null,null,"September, 2015","Rates Effective 8/1/2015"]
[null,null,null,null,null,null,null,null,null,null,null,null,null,null,null,null,null,null,"October, 2015","Rates Effective 8/1/2015"]
[null,null,null,null,null,null,null,null,null,null,null,null,null,null,null,null,null,null,"November, 2015","Rates Effective 8/1/2015"]
[null,null,null,null,null,null,null,null,null,null,null,null,null,null,null,null,null,null,"December, 2015","Rates Effective 8/1/2015"]
[null,null,null,null,null,null,null,null,null,null,null,null,null,null,null,null,null,null,"January, 2016","Rates Effective 8/1/2015"]
[null,null,null,null,null,null,null,null,null,null,null,null,null,null,null,null,null,null,"February, 2016","Rates Effective 8/1/2015"]
[null,null,null,null,null,null,null,null,null,null,null,null,null,null,null,null,null,null,"March, 2016","Rates Effective 8/1/2015"]
[null,null,null,null,null,null,null,null,null,null,null,null,null,null,null,null,null,null,"April, 2016","Rates Effective 8/1/2015"]
[null,null,null,null,null,null,null,null,null,null,null,null,null,null,null,null,null,null,"May, 2016","Rates Effective 8/1/2015"]
[null,null,null,null,null,null,null,null,null,null,null,null,null,null,null,null,null,null,"June, 2016","Rates Effective 8/1/2015"]
[null,null,null,null,null,null,null,null,null,null,null,null,null,null,null,null,null,null,"July, 2016","Rates Effective 8/1/2015"]
[null,null,null,null,null,null,null,null,null,null,null,null,null,null,null,null,null,null,"August, 2016","Rates Effective 8/1/2016"]
[null,null,null,null,null,null,null,null,null,null,null,null,null,null,null,null,null,null,"September, 2016","Rates Effective 8/1/2016"]
[null,null,null,null,null,null,null,null,null,null,null,null,null,null,null,null,null,null,"October, 2016","Rates Effective 8/1/2016"]
[null,null,null,null,null,null,null,null,null,null,null,null,null,null,null,null,null,null,"November, 2016","Rates Effective 8/1/2016"]
[null,null,null,null,null,null,null,null,null,null,null,null,null,null,null,null,null,null,"December, 2016","Rates Effective 8/1/2016"]
[null,null,null,null,null,null,null,null,null,null,null,null,null,null,null,null,null,null,"January, 2017","Rates Effective 8/1/2016"]
[null,null,null,null,null,null,null,null,null,null,null,null,null,null,null,null,null,null,"February, 2017","Rates Effective 8/1/2016"]
[null,null,null,null,null,null,null,null,null,null,null,null,null,null,null,null,null,null,"March, 2017","Rates Effective 8/1/2016"]
[null,null,null,null,null,null,null,null,null,null,null,null,null,null,null,null,null,null,"April, 2017","Rates Effective 8/1/2016"]
[null,null,null,null,null,null,null,null,null,null,null,null,null,null,null,null,null,null,"May, 2017","Rates Effective 8/1/2016"]
[null,null,null,null,null,null,null,null,null,null,null,null,null,null,null,null,null,null,"June, 2017","Rates Effective 8/1/2016"]
[null,null,null,null,null,null,null,null,null,null,null,null,null,null,null,null,null,null,"July, 2017","Rates Effective 8/1/2016"]
[null,null,null,null,null,null,null,null,null,null,null,null,null,null,null,null,null,null,"August, 2017","Rates Effective 8/1/2017"]
[null,null,null,null,null,null,null,null,null,null,null,null,null,null,null,null,null,null,"September, 2017","Rates Effective 8/1/2017"]
[null,null,null,null,null,null,null,null,null,null,null,null,null,null,null,null,null,null,"October, 2017","Rates Effective 8/1/2017"]
[null,null,null,null,null,null,null,null,null,null,null,null,null,null,null,null,null,null,"November, 2017","Rates Effective 8/1/2017"]
[null,null,null,null,null,null,null,null,null,null,null,null,null,null,null,null,null,null,"December, 2017","Rates Effective 8/1/2017"]
[null,null,null,null,null,null,null,null,null,null,null,null,null,null,null,null,null,null,"January, 2018","Rates Effective 8/1/2017"]
[null,null,null,null,null,null,null,null,null,null,null,null,null,null,null,null,null,null,"February, 2018","Rates Effective 8/1/2017"]
[null,null,null,null,null,null,null,null,null,null,null,null,null,null,null,null,null,null,"March, 2018","Rates Effective 8/1/2017"]
[null,null,null,null,null,null,null,null,null,null,null,null,null,null,null,null,null,null,"April, 2018","Rates Effective 8/1/2017"]
[null,null,null,null,null,null,null,null,null,null,null,null,null,null,null,null,null,null,"May, 2018","Rates Effective 8/1/2017"]
[null,null,null,null,null,null,null,null,null,null,null,null,null,null,null,null,null,null,"June, 2018","Rates Effective 8/1/2017"]
[null,null,null,null,null,null,null,null,null,null,null,null,null,null,null,null,null,null,"July, 2018","Rates Effective 8/1/2017"]
[null,null,null,null,null,null,null,null,null,null,null,null,null,null,null,null,null,null,"August, 2018","Rates Effective 8/1/2018"]
[null,null,null,null,null,null,null,null,null,null,null,null,null,null,null,null,null,null,"September, 2018","Rates Effective 8/1/2018"]
[null,null,null,null,null,null,null,null,null,null,null,null,null,null,null,null,null,null,"October, 2018","Rates Effective 8/1/2018"]
[null,null,null,null,null,null,null,null,null,null,null,null,null,null,null,null,null,null,"November, 2018","Rates Effective 8/1/2018"]
[null,null,null,null,null,null,null,null,null,null,null,null,null,null,null,null,null,null,"December, 2018","Rates Effective 8/1/2018"]
[null,null,null,null,null,null,null,null,null,null,null,null,null,null,null,null,null,null,"January, 2019","Rates Effective 8/1/2018"]
[null,null,null,null,null,null,null,null,null,null,null,null,null,null,null,null,null,null,"February, 2019","Rates Effective 8/1/2018"]
[null,null,null,null,null,null,null,null,null,null,null,null,null,null,null,null,null,null,"March, 2019","Rates Effective 8/1/2018"]
[null,null,null,null,null,null,null,null,null,null,null,null,null,null,null,null,null,null,"April, 2019","Rates Effective 8/1/2018"]
[null,null,null,null,null,null,null,null,null,null,null,null,null,null,null,null,null,null,"May, 2019","Rates Effective 8/1/2018"]
[null,null,null,null,null,null,null,null,null,null,null,null,null,null,null,null,null,null,"June, 2019","Rates Effective 8/1/2018"]
[null,null,null,null,null,null,null,null,null,null,null,null,null,null,null,null,null,null,"July, 2019","Rates Effective 8/1/2018"]
[null,null,null,null,null,null,null,null,null,null,null,null,null,null,null,null,null,null,"August, 2019","Rates Effective 8/1/2019"]
[null,null,null,null,null,null,null,null,null,null,null,null,null,null,null,null,null,null,"September, 2019","Rates Effective 8/1/2019"]
[null,null,null,null,null,null,null,null,null,null,null,null,null,null,null,null,null,null,"October, 2019","Rates Effective 8/1/2019"]
[null,null,null,null,null,null,null,null,null,null,null,null,null,null,null,null,null,null,"November, 2019","Rates Effective 8/1/2019"]
[null,null,null,null,null,null,null,null,null,null,null,null,null,null,null,null,null,null,"December, 2019","Rates Effective 8/1/2019"]
[null,null,null,null,null,null,null,null,null,null,null,null,null,null,null,null,null,null,"January, 2020","Rates Effective 8/1/2019"]
[null,null,null,null,null,null,null,null,null,null,null,null,null,null,null,null,null,null,"February, 2020","Rates Effective 8/1/2019"]
[null,null,null,null,null,null,null,null,null,null,null,null,null,null,null,null,null,null,"March, 2020","Rates Effective 8/1/2019"]
[null,null,null,null,null,null,null,null,null,null,null,null,null,null,null,null,null,null,"April, 2020","Rates Effective 8/1/2019"]
[null,null,null,null,null,null,null,null,null,null,null,null,null,null,null,null,null,null,"May, 2020","Rates Effective 8/1/2019"]
[null,null,null,null,null,null,null,null,null,null,null,null,null,null,null,null,null,null,"June, 2020","Rates Effective 8/1/2019"]
[null,null,null,null,null,null,null,null,null,null,null,null,null,null,null,null,null,null,"July, 2020","Rates Effective 8/1/2019"]
[null,null,null,null,null,null,null,null,null,null,null,null,null,null,null,null,null,null,"August, 2020","Rates Effective 8/1/2020"]
[null,null,null,null,null,null,null,null,null,null,null,null,null,null,null,null,null,null,"September, 2020","Rates Effective 8/1/2020"]
[null,null,null,null,null,null,null,null,null,null,null,null,null,null,null,null,null,null,"October, 2020","Rates Effective 8/1/2020"]
[null,null,null,null,null,null,null,null,null,null,null,null,null,null,null,null,null,null,"November, 2020","Rates Effective 8/1/2020"]
[null,null,null,null,null,null,null,null,null,null,null,null,null,null,null,null,null,null,"December, 2020","Rates Effective 8/1/2020"]
[null,null,null,null,null,null,null,null,null,null,null,null,null,null,null,null,null,null,"January, 2021","Rates Effective 8/1/2020"]
[null,null,null,null,null,null,null,null,null,null,null,null,null,null,null,null,null,null,"February, 2021","Rates Effective 8/1/2020"]
[null,null,null,null,null,null,null,null,null,null,null,null,null,null,null,null,null,null,"March, 2021","Rates Effective 8/1/2020"]
[null,null,null,null,null,null,null,null,null,null,null,null,null,null,null,null,null,null,"April, 2021","Rates Effective 8/1/2020"]
[null,null,null,null,null,null,null,null,null,null,null,null,null,null,null,null,null,null,"May, 2021","Rates Effective 8/1/2020"]
[null,null,null,null,null,null,null,null,null,null,null,null,null,null,null,null,null,null,"June, 2021","Rates Effective 8/1/2020"]
[null,null,null,null,null,null,null,null,null,null,null,null,null,null,null,null,null,null,"July, 2021","Rates Effective 8/1/2020"]

{"sheet":"Sheet2","index":2,"n_rows":0,"n_cols":0,"rows_kept":0,"cut":false,"hidden":false,"merged":[]}